Reaction Details
Targetcholinergic receptor, nicotinic, alpha 1 (Muscle) isoform X1
LigandBDBM86044
Substrate/Competitorn/a
Ki 100±n/a nM
CommentsPDSP_2903
Citation Avalos, MParker, MJMaddox, FNCarroll, FILuetje, CW Effects of pyridine ring substitutions on affinity, efficacy, and subtype selectivity of neuronal nicotinic receptor agonist epibatidine. J Pharmacol Exp Ther302:1246-52 (2002) 
 
cholinergic receptor, nicotinic, alpha 1 (Muscle) isoform X1
Name:cholinergic receptor, nicotinic, alpha 1 (Muscle) isoform X1
Synonyms:Cholinergic, Nicotinic Alpha3Beta2
Type:Enzyme Catalytic Domain
Mol. Mass.:51980.65
Organism:Xenopus
Description:Cholinergic, Nicotinic Alpha3Beta2 0 Xenopus::F6RLM5
Residue:457
BDBM86044
NameBDBM86044
Synonyms:NTEP
TypeSmall organic molecule
Emp. Form.C12H13F3N2O3S
Mol. Mass.322.303
SMILESFC(F)(F)S(=O)(=O)Oc1ccc(cn1)[C@H]1CC2CCC1N2