Reaction Details
TargetCholinergic receptor, nicotinic alpha 1
LigandBDBM86041
Substrate/Competitorn/a
Ki 0.48±n/a nM
CommentsPDSP_2906
Citation Avalos, MParker, MJMaddox, FNCarroll, FILuetje, CW Effects of pyridine ring substitutions on affinity, efficacy, and subtype selectivity of neuronal nicotinic receptor agonist epibatidine. J Pharmacol Exp Ther302:1246-52 (2002) 
 
Cholinergic receptor, nicotinic alpha 1
Name:Cholinergic receptor, nicotinic alpha 1
Type:Enzyme Catalytic Domain
Mol. Mass.:52341.78
Organism:Xenopus
Description:Cholinergic, Nicotinic Alpha4Beta4 0 Xenopus::F6RLA9
Residue:457
BDBM86041
NameBDBM86041
Synonyms:NFEP
TypeSmall organic molecule
Emp. Form.C11H13FN2
Mol. Mass.192.2327
SMILESFc1ccc(cn1)[C@H]1CC2CCC1N2