Reaction Details
TargetSodium-dependent serotonin transporter
LigandBDBM82217
Substrate/Competitorn/a
Ki 0.26±n/a nM
CommentsPDSP_1710
Citation Owens, JMKnight, DLNemeroff, CB [Second generation SSRIS: human monoamine transporter binding profile of escitalopram and R-fluoxetine]. Encephale28:350-5 (2002) Sodium-dependent serotonin transporter
Name:Sodium-dependent serotonin transporter
Type:Multi-pass membrane protein
Mol. Mass.:70322.51
Organism:Homo sapiens (Human)
Description:P31645
Residue:630
BDBM82217
NameBDBM82217
Synonyms:CHEMBL284994 SERTRALINE | [4-(3,4-Dichloro-phenyl)-1,2,3,4-tetrahydro-naphthalen-1-yl]-methyl-amine
Typen/a
Emp. Form.C17H17Cl2N
Mol. Mass.306.23
SMILESCN[C@@H]1CC[C@@H](c2ccc(Cl)c(Cl)c2)c2ccccc12