Reaction Details
TargetMuscarinic acetylcholine receptor M1
LigandBDBM50028091
Substrate/Competitorn/a
Ki>10000±n/a nM
CommentsPDSP_844
Citation Owens, JMKnight, DLNemeroff, CB [Second generation SSRIS: human monoamine transporter binding profile of escitalopram and R-fluoxetine]. Encephale28:350-5 (2002) Muscarinic acetylcholine receptor M1
Name:Muscarinic acetylcholine receptor M1
Type:Protein
Mol. Mass.:51442.54
Organism:Homo sapiens (Human)
Description:P11229
Residue:460
BDBM50028091
NameBDBM50028091
Synonyms:(1E)-5-methoxy-1-[4-(trifluoromethyl)phenyl]pentan-1-one O-(2-aminoethyl)oxime FLUVOXAMINE
TypeSmall organic molecule
Emp. Form.C15H21F3N2O2
Mol. Mass.318.3346
SMILESCOCCCC\C(=N/OCCN)c1ccc(cc1)C(F)(F)F