Reaction Details
TargetMuscarinic acetylcholine receptor M1
LigandBDBM86231
Substrate/Competitorn/a
Ki 1±n/a nM
CommentsPDSP_334
Citation Cheng, KKhurana, SChen, YKennedy, RHZimniak, PRaufman, JP Lithocholylcholine, a bile acid/acetylcholine hybrid, is a muscarinic receptor antagonist. J Pharmacol Exp Ther303:29-35 (2002) 
 
Muscarinic acetylcholine receptor M1
Name:Muscarinic acetylcholine receptor M1
Type:Enzyme Catalytic Domain
Mol. Mass.:51390.46
Organism:RAT
Description:P08482
Residue:460
BDBM86231
NameBDBM86231
Synonyms:ATR Atropine,(-) CHEMBL195 US9333195, ATROPINE
TypeSmall organic molecule
Emp. Form.C17H23NO3
Mol. Mass.289.3694
SMILESCN1C2CCC1CC(C2)OC(=O)C(CO)c1ccccc1