Reaction Details
TargetMu-type opioid receptor
LigandBDBM85331
Substrate/Competitorn/a
Ki 0.99±n/a nM
CommentsPDSP_1962
Citation Gharagozlou, PDemirci, HDavid Clark, JLameh, J Activity of opioid ligands in cells expressing cloned mu opioid receptors. BMC Pharmacol3:1 (2003) 
 
Mu-type opioid receptor
Name:Mu-type opioid receptor
Type:G Protein-Coupled Receptor (GPCR)
Mol. Mass.:44789.51
Organism:Homo sapiens (Human)
Description:P35372
Residue:400
BDBM85331
NameBDBM85331
Synonyms:CAS_115077 WIN 44,441(-)
TypeSmall organic molecule
Emp. Form.C25H37NO2
Mol. Mass.383.5668
SMILESCN1CCC2(C)c3cc(O)ccc3CC1C2(C)CCC(=O)CCC1CCCC1