Reaction Details
TargetGamma-aminobutyric acid type B receptor subunit 1
LigandBDBM86057
Substrate/Competitorn/a
Ki>10000±n/a nM
CommentsPDSP_3030
Citation Hameg, ABayle, FNuss, PDupuis, PGaray, RPDib, M Affinity of cyamemazine, an anxiolytic antipsychotic drug, for human recombinant dopamine vs. serotonin receptor subtypes. Biochem Pharmacol65:435-40 (2003) 
 
Gamma-aminobutyric acid type B receptor subunit 1
Name:Gamma-aminobutyric acid type B receptor subunit 1
Type:Enzyme Catalytic Domain
Mol. Mass.:111548.69
Organism:Rattus norvegicus (Rat)
Description:Q9Z0U4
Residue:991
BDBM86057
NameBDBM86057
Synonyms:CAS_62865 NSC_62865
TypeSmall organic molecule
Emp. Form.C19H21N3S
Mol. Mass.323.455
SMILESCC(CN(C)C)CN1c2ccccc2Sc2ccc(cc12)C#N