Reaction Details
TargetCyclin-dependent kinase 2
LigandBDBM27216
Substrate/Competitorn/a
Ki 100±n/a nM
CommentsPDSP_6405
Citation Bain, JMcLauchlan, HElliott, MCohen, P The specificities of protein kinase inhibitors: an update. Biochem J371:199-204 (2003) 
 
Cyclin-dependent kinase 2
Name:Cyclin-dependent kinase 2
Type:Enzyme Subunit
Mol. Mass.:33938.17
Organism:Homo sapiens (Human)
Description:P24941
Residue:298
BDBM27216
NameBDBM27216
Synonyms:(2R)-2-({6-[(3-chlorophenyl)amino]-9-(propan-2-yl)-9H-purin-2-yl}amino)-3-methylbutan-1-ol CHEMBL23327 | Purvalanol A
TypeSmall organic molecule
Emp. Form.C19H25ClN6O
Mol. Mass.388.894
SMILESCC(C)[C@H](CO)Nc1nc(Nc2cccc(Cl)c2)c2ncn(C(C)C)c2n1