Reaction Details
TargetNinein
LigandBDBM7266
Substrate/Competitorn/a
Ki 230±n/a nM
CommentsPDSP_6407
Citation Bain, JMcLauchlan, HElliott, MCohen, P The specificities of protein kinase inhibitors: an update. Biochem J371:199-204 (2003) 
 
Ninein
Name:Ninein
Type:Enzyme Catalytic Domain
Mol. Mass.:243138.33
Organism:Homo sapiens (Human)
Description:Glycogen synthase kinase 3 0 HUMAN::Q8N4C6
Residue:2090
BDBM7266
NameBDBM7266
Synonyms:14-bromo-8,18-diazatetracyclo[9.7.0.0^{2,7}.0^{12,17}]octadeca-1(11),2,4,6,12(17),13,15-heptaen-9-one CHEMBL296586 NSC 664704 cid_3820
TypeSmall organic molecule
Emp. Form.C16H11BrN2O
Mol. Mass.327.175
SMILESBrc1ccc2[nH]c-3c(CC(=O)Nc4ccccc-34)c2c1