Reaction Details
TargetTyrosine-protein kinase Lck
LigandBDBM7393
Substrate/Competitorn/a
Ki 300±n/a nM
CommentsPDSP_6406
Citation Bain, JMcLauchlan, HElliott, MCohen, P The specificities of protein kinase inhibitors: an update. Biochem J371:199-204 (2003) 
 
Tyrosine-protein kinase Lck
Name:Tyrosine-protein kinase Lck
Type:n/a
Mol. Mass.:57987.83
Organism:Homo sapiens (Human)
Description:P06239
Residue:509
BDBM7393
NameBDBM7393
Synonyms:3-[(2Z,3E)-3-(hydroxyimino)-2,3-dihydro-1H-indol-2-ylidene]-2,3-dihydro-1H-indol-2-one Indirubin-3 -monoxime Indirubin-3monoxime | indirubin deriv. 7h
Typen/a
Emp. Form.C16H11N3O2
Mol. Mass.277.2774
SMILESO=Nc1c([nH]c2ccccc12)C1C(=O)Nc2ccccc12