Reaction Details
TargetTyrosine-protein kinase Lck
LigandBDBM7266
Substrate/Competitorn/a
Ki 470±n/a nM
CommentsPDSP_6407
Citation Bain, JMcLauchlan, HElliott, MCohen, P The specificities of protein kinase inhibitors: an update. Biochem J371:199-204 (2003) 
 
Tyrosine-protein kinase Lck
Name:Tyrosine-protein kinase Lck
Type:n/a
Mol. Mass.:57987.83
Organism:Homo sapiens (Human)
Description:P06239
Residue:509
BDBM7266
NameBDBM7266
Synonyms:14-bromo-8,18-diazatetracyclo[9.7.0.0^{2,7}.0^{12,17}]octadeca-1(11),2,4,6,12(17),13,15-heptaen-9-one CHEMBL296586 NSC 664704 cid_3820
TypeSmall organic molecule
Emp. Form.C16H11BrN2O
Mol. Mass.327.175
SMILESBrc1ccc2[nH]c-3c(CC(=O)Nc4ccccc-34)c2c1