Reaction Details
TargetExcitatory amino acid transporter 2
LigandBDBM86058
Substrate/Competitorn/a
Ki 1000±n/a nM
CommentsPDSP_3044
Citation Chaki, SHirota, SFunakoshi, TSuzuki, YSuetake, SOkubo, TIshii, TNakazato, AOkuyama, S Anxiolytic-like and antidepressant-like activities of MCL0129 (1-[(S)-2-(4-fluorophenyl)-2-(4-isopropylpiperadin-1-yl)ethyl]-4-[4-(2-methoxynaphthalen-1-yl)butyl]piperazine), a novel and potent nonpeptide antagonist of the melanocortin-4 receptor. J Pharmacol Exp Ther304:818-26 (2003) 
 
Excitatory amino acid transporter 2
Name:Excitatory amino acid transporter 2
Type:Enzyme Catalytic Domain
Mol. Mass.:62103.57
Organism:Homo sapiens (Human)
Description:Excitatory Amino Acid EAAT2 0 0::P43004
Residue:574
BDBM86058
NameBDBM86058
Synonyms:MCL0129
TypeSmall organic molecule
Emp. Form.C34H47FN4O
Mol. Mass.546.7616
SMILESCOc1ccc2ccccc2c1CCCCN1CCN(C[C@@H](N2CCN(CC2)C(C)C)c2ccc(F)cc2)CC1