Reaction Details
TargetPolyphenol oxidase 2
LigandBDBM86063
Substrate/Competitorn/a
Meas. Tech.Catecholase Activity Assay
pH6.8±0
Temperature293.15±0 K
Ki 2.18e+4±n/a nM
Citation Alijanianzadeh, MSaboury, AAMansuri-Torshizi, HHaghbeen, KMoosavi-Movahedi, AA The inhibitory effect of some new synthesized xanthates on mushroom tyrosinase activities. J Enzyme Inhib Med Chem22:239-46 (2007) 
 
Polyphenol oxidase 2
Name:Polyphenol oxidase 2
Type:Protein
Mol. Mass.:63923.66
Organism:Agaricus bisporus (Common mushroom)
Description:O42713
Residue:556
BDBM86063
NameBDBM86063
Synonyms:Iso-butyl xanthate, II
TypeSmall organic molecule
Emp. Form.C5H9NaOS2
Mol. Mass.172.244
SMILESCC(C)COC(=S)S[Na]