Reaction Details
TargetPolyphenol oxidase 2
LigandBDBM86062
Substrate/Competitorn/a
Meas. Tech.Cresolase Activity Assay
pH6.8±0
Temperature293.15±0 K
Ki 9.8e+3±n/a nM
Citation Alijanianzadeh, MSaboury, AAMansuri-Torshizi, HHaghbeen, KMoosavi-Movahedi, AA The inhibitory effect of some new synthesized xanthates on mushroom tyrosinase activities. J Enzyme Inhib Med Chem22:239-46 (2007) 
 
Polyphenol oxidase 2
Name:Polyphenol oxidase 2
Type:Protein
Mol. Mass.:63923.66
Organism:Agaricus bisporus (Common mushroom)
Description:O42713
Residue:556
BDBM86062
NameBDBM86062
Synonyms:Iso-propyl xanthate, I
TypeSmall organic molecule
Emp. Form.C4H7NaOS2
Mol. Mass.158.218
SMILESCC(C)OC(=S)S[Na]