Reaction Details
TargetTransthyretin
LigandBDBM249481
Substrate/Competitorn/a
Meas. Tech.Scintillation Proximity RBP4 Binding Assay
pH7.4±n/a
Temperature298.15±n/a K
IC50 6.10±n/a nM
Commentsextracted
Citation Petrukhin, KCioffi, CJohnson, GAllikmets, RFreeman, EChen, PConlon, MZhu, L Substituted 4-phenylpiperidines, their preparation and use US Patent US10072016 Publication Date 9/11/2018
 
Transthyretin
Name:Transthyretin
Type:Enzyme
Mol. Mass.:15884.31
Organism:Homo sapiens (Human)
Description:P02766
Residue:147
BDBM249481
NameBDBM249481
Synonyms:US10072016, Compound 79 US10913746, Compound 79 US9434727, 79 | US9777010, Compound 79
TypeSmall organic molecule
Emp. Form.C23H26F4N4O
Mol. Mass.450.4724
SMILESFc1cccc(C2CCN(CC2)C(=O)c2n[nH]c3CN(CC4CC4)CCc23)c1C(F)(F)F