Reaction Details
TargetTransthyretin
LigandBDBM249487
Substrate/Competitorn/a
Meas. Tech.Scintillation Proximity RBP4 Binding Assay
pH7.4±n/a
Temperature298.15±n/a K
IC50 22.4±n/a nM
Commentsextracted
Citation Petrukhin, KCioffi, CJohnson, GAllikmets, RFreeman, EChen, PConlon, MZhu, L Substituted 4-phenylpiperidines, their preparation and use US Patent US10072016 Publication Date 9/11/2018
 
Transthyretin
Name:Transthyretin
Type:Enzyme
Mol. Mass.:15884.31
Organism:Homo sapiens (Human)
Description:P02766
Residue:147
BDBM249487
NameBDBM249487
Synonyms:US10072016, Compound 85 US10913746, Compound 85 US9434727, 85 | US9777010, Compound 85
TypeSmall organic molecule
Emp. Form.C22H23F5N4O2
Mol. Mass.470.4356
SMILESCC(C)C(=O)N1Cc2[nH]nc(C(=O)N3CCC(CC3)c3ccc(F)c(F)c3C(F)(F)F)c2C1