Reaction Details
TargetTransthyretin
LigandBDBM249489
Substrate/Competitorn/a
Meas. Tech.Scintillation Proximity RBP4 Binding Assay
pH7.4±n/a
Temperature298.15±n/a K
IC50 16.4±n/a nM
Commentsextracted
Citation Petrukhin, KCioffi, CJohnson, GAllikmets, RFreeman, EChen, PConlon, MZhu, L Substituted 4-phenylpiperidines, their preparation and use US Patent US10072016 Publication Date 9/11/2018
 
Transthyretin
Name:Transthyretin
Type:Enzyme
Mol. Mass.:15884.31
Organism:Homo sapiens (Human)
Description:P02766
Residue:147
BDBM249489
NameBDBM249489
Synonyms:US10072016, Compound 87 US10913746, Compound 87 US9434727, 87 | US9777010, Compound 87
TypeSmall organic molecule
Emp. Form.C21H23F5N4O
Mol. Mass.442.4255
SMILESCCN1CCc2[nH]nc(C(=O)N3CCC(CC3)c3ccc(F)c(F)c3C(F)(F)F)c2C1