Reaction Details
TargetTransthyretin
LigandBDBM249512
Substrate/Competitorn/a
Meas. Tech.Scintillation Proximity RBP4 Binding Assay
pH7.4±n/a
Temperature298.15±n/a K
IC50 15.4±n/a nM
Commentsextracted
Citation Petrukhin, KCioffi, CJohnson, GAllikmets, RFreeman, EChen, PConlon, MZhu, L Substituted 4-phenylpiperidines, their preparation and use US Patent US10072016 Publication Date 9/11/2018
 
Transthyretin
Name:Transthyretin
Type:Enzyme
Mol. Mass.:15884.31
Organism:Homo sapiens (Human)
Description:P02766
Residue:147
BDBM249512
NameBDBM249512
Synonyms:US10072016, Compound 110 US10913746, Compound 110 US9434727, 110 | US9777010, Compound 110
TypeSmall organic molecule
Emp. Form.C19H16F5N5O
Mol. Mass.425.3553
SMILESFc1ccc(C2CCN(CC2)C(=O)c2n[nH]c3CN(Cc23)C#N)c(c1F)C(F)(F)F