Reaction Details
TargetTransthyretin
LigandBDBM249522
Substrate/Competitorn/a
Meas. Tech.Scintillation Proximity RBP4 Binding Assay
pH7.4±n/a
Temperature298.15±n/a K
IC50 21.0±n/a nM
Commentsextracted
Citation Petrukhin, KCioffi, CJohnson, GAllikmets, RFreeman, EChen, PConlon, MZhu, L Substituted 4-phenylpiperidines, their preparation and use US Patent US10072016 Publication Date 9/11/2018
 
Transthyretin
Name:Transthyretin
Type:Enzyme
Mol. Mass.:15884.31
Organism:Homo sapiens (Human)
Description:P02766
Residue:147
BDBM249522
NameBDBM249522
Synonyms:US10072016, Compound 120 US10913746, Compound 120 US9434727, 120 | US9777010, Compound 120
TypeSmall organic molecule
Emp. Form.C20H18F5N5O
Mol. Mass.439.3818
SMILESFc1ccc(C2CCN(CC2)C(=O)c2n[nH]c3CN(CCc23)C#N)c(c1F)C(F)(F)F