Reaction Details
TargetTransthyretin
LigandBDBM249533
Substrate/Competitorn/a
Meas. Tech.Scintillation Proximity RBP4 Binding Assay
pH7.4±n/a
Temperature298.15±n/a K
IC50 10.9±n/a nM
Commentsextracted
Citation Petrukhin, KCioffi, CJohnson, GAllikmets, RFreeman, EChen, PConlon, MZhu, L Substituted 4-phenylpiperidines, their preparation and use US Patent US10072016 Publication Date 9/11/2018
 
Transthyretin
Name:Transthyretin
Type:Enzyme
Mol. Mass.:15884.31
Organism:Homo sapiens (Human)
Description:P02766
Residue:147
BDBM249533
NameBDBM249533
Synonyms:US10072016, Compound 131 US10913746, Compound 131 US9434727, 131 | US9777010, Compound 131
TypeSmall organic molecule
Emp. Form.C21H21F5N4O2
Mol. Mass.456.4091
SMILESCC(=O)N1CCc2c(C1)[nH]nc2C(=O)N1CCC(CC1)c1cc(F)cc(F)c1C(F)(F)F