Reaction Details
TargetTransthyretin
LigandBDBM249537
Substrate/Competitorn/a
Meas. Tech.Scintillation Proximity RBP4 Binding Assay
pH7.4±n/a
Temperature298.15±n/a K
IC50 21.0±n/a nM
Commentsextracted
Citation Petrukhin, KCioffi, CJohnson, GAllikmets, RFreeman, EChen, PConlon, MZhu, L Substituted 4-phenylpiperidines, their preparation and use US Patent US10072016 Publication Date 9/11/2018
 
Transthyretin
Name:Transthyretin
Type:Enzyme
Mol. Mass.:15884.31
Organism:Homo sapiens (Human)
Description:P02766
Residue:147
BDBM249537
NameBDBM249537
Synonyms:US10072016, Compound 135 US10913746, Compound 135 US9434727, 135 | US9777010, Compound 135
TypeSmall organic molecule
Emp. Form.C22H23F5N4O2
Mol. Mass.470.4356
SMILESFc1cc(F)c(c(c1)C1CCN(CC1)C(=O)c1n[nH]c2CN(CCc12)C1COC1)C(F)(F)F