Reaction Details
TargetTransthyretin
LigandBDBM249540
Substrate/Competitorn/a
Meas. Tech.Scintillation Proximity RBP4 Binding Assay
pH7.4±n/a
Temperature298.15±n/a K
IC50 24.4±n/a nM
Commentsextracted
Citation Petrukhin, KCioffi, CJohnson, GAllikmets, RFreeman, EChen, PConlon, MZhu, L Substituted 4-phenylpiperidines, their preparation and use US Patent US10072016 Publication Date 9/11/2018
 
Transthyretin
Name:Transthyretin
Type:Enzyme
Mol. Mass.:15884.31
Organism:Homo sapiens (Human)
Description:P02766
Residue:147
BDBM249540
NameBDBM249540
Synonyms:US10072016, Compound 138 US10913746, Compound 138 US9434727, 138 | US9777010, Compound 138
TypeSmall organic molecule
Emp. Form.C21H21F5N4O3
Mol. Mass.472.4085
SMILESCOC(=O)N1CCc2[nH]nc(C(=O)N3CCC(CC3)c3cc(F)cc(F)c3C(F)(F)F)c2C1