Reaction Details
TargetTransthyretin
LigandBDBM249550
Substrate/Competitorn/a
Meas. Tech.Scintillation Proximity RBP4 Binding Assay
pH7.4±n/a
Temperature298.15±n/a K
IC50 7.41±n/a nM
Commentsextracted
Citation Petrukhin, KCioffi, CJohnson, GAllikmets, RFreeman, EChen, PConlon, MZhu, L Substituted 4-phenylpiperidines, their preparation and use US Patent US10072016 Publication Date 9/11/2018
 
Transthyretin
Name:Transthyretin
Type:Enzyme
Mol. Mass.:15884.31
Organism:Homo sapiens (Human)
Description:P02766
Residue:147
BDBM249550
NameBDBM249550
Synonyms:US10072016, Compound 148 US10913746, Compound 148 US9434727, 148 | US9777010, Compound 148
TypeSmall organic molecule
Emp. Form.C19H19ClFN5O
Mol. Mass.387.838
SMILESFc1cccc(C2CCN(CC2)C(=O)c2n[nH]c3CN(CCc23)C#N)c1Cl