Reaction Details
TargetD(1A) dopamine receptor
LigandBDBM50049047
Substrate/Competitorn/a
Ki 2.2±n/a nM
CommentsPDSP_664
Citation Qandil, AMLewis, MMJassen, ALeonard, SKMailman, RBNichols, DE Synthesis and pharmacological evaluation of substituted naphth[1,2,3-de]isoquinolines (dinapsoline analogues) as D1 and D2 dopamine receptor ligands. Bioorg Med Chem11:1451-64 (2003) 
 
D(1A) dopamine receptor
Name:D(1A) dopamine receptor
Type:Enzyme Catalytic Domain
Mol. Mass.:49429.75
Organism:RAT
Description:P18901
Residue:446
BDBM50049047
NameBDBM50049047
Synonyms:5,6,6a,7,8,12b-Hexahydro-benzo[a]phenanthridine-10,11-diol Dihydrexidine | Dihydrexidine, DHX
TypeSmall organic molecule
Emp. Form.C17H17NO2
Mol. Mass.267.3224
SMILESOc1cc2CCC3NCc4ccccc4C3c2cc1O