Reaction Details
TargetD(1B) dopamine receptor
LigandBDBM50004923
Substrate/Competitorn/a
Ki 80±n/a nM
CommentsPDSP_1719
Citation Qandil, AMLewis, MMJassen, ALeonard, SKMailman, RBNichols, DE Synthesis and pharmacological evaluation of substituted naphth[1,2,3-de]isoquinolines (dinapsoline analogues) as D1 and D2 dopamine receptor ligands. Bioorg Med Chem11:1451-64 (2003) 
 
D(1B) dopamine receptor
Name:D(1B) dopamine receptor
Type:Enzyme Catalytic Domain
Mol. Mass.:52827.88
Organism:RAT
Description:Dopamine D1B 0 RAT::P25115
Residue:475
BDBM50004923
NameBDBM50004923
Synonyms:(+/-)-SKF-38393 1-Phenyl-2,3,4,5-tetrahydro-1H-benzo[d]azepine-7,8-diol (SK&F 38393) 1-Phenyl-2,3,4,5-tetrahydro-1H-benzo[d]azepine-7,8-diol; hydrochloride(SKF 38393) CHEMBL505308 RS(+/-)SKF 383931-Phenyl-2,3,4,5-tetrahydro-1H-benzo[d]azepine-7,8-diol SK-38393 SKF-38393 cid_147514
TypeSmall organic molecule
Emp. Form.C16H17NO2
Mol. Mass.255.3117
SMILESOc1cc2CCNCC(c3ccccc3)c2cc1O