Reaction Details
TargetCorticotropin-releasing factor receptor 1
LigandBDBM50058163
Substrate/Competitorn/a
Ki 1.2±n/a nM
CommentsPDSP_570
Citation Zhang, GHuang, NLi, YWQi, XMarshall, APYan, XXHill, GRominger, CPrakash, SRBakthavatchalam, RRominger, DHGilligan, PJZaczek, R Pharmacological characterization of a novel nonpeptide antagonist radioligand, (+/-)-N-[2-methyl-4-methoxyphenyl]-1-(1-(methoxymethyl) propyl)-6-methyl-1H-1,2,3-triazolo[4,5-c]pyridin-4-amine ([3H]SN003) for corticotropin-releasing factor1 receptors. J Pharmacol Exp Ther305:57-69 (2003) 
 
Corticotropin-releasing factor receptor 1
Name:Corticotropin-releasing factor receptor 1
Type:Enzyme
Mol. Mass.:50744.31
Organism:Homo sapiens (Human)
Description:P34998
Residue:444
BDBM50058163
NameBDBM50058163
Synonyms:Butyl-[2,5-dimethyl-7-(2,4,6-trimethyl-phenyl)-7H-pyrrolo[2,3-d]pyrimidin-4-yl]-ethyl-amine CP 154,526 N-butyl-N-ethyl-7-mesityl-2,5-dimethyl-7H-pyrrolo[2,3-d]pyrimidin-4-amine
TypeSmall organic molecule
Emp. Form.C23H32N4
Mol. Mass.364.527
SMILESCCCCN(CC)c1nc(C)nc2n(cc(C)c12)-c1c(C)cc(C)cc1C