Reaction Details
TargetThyrotropin-releasing hormone receptor
LigandBDBM86217
Substrate/Competitorn/a
Ki 3000±n/a nM
CommentsPDSP_3208
Citation Lu, XBidaud, ILadram, AGershengorn, MC Pharmacological studies of thyrotropin-releasing hormone (TRH) receptors from Xenopus laevis: is xTRHR3 a TRH receptor? Endocrinology144:1842-6 (2003) 
 
Thyrotropin-releasing hormone receptor
Name:Thyrotropin-releasing hormone receptor
Type:Enzyme Catalytic Domain
Mol. Mass.:44987.02
Organism:Xenopus
Description:Q9DDR1
Residue:397
BDBM86217
NameBDBM86217
Synonyms:Desaza1TRH
TypeSmall organic molecule
Emp. Form.C17H23N5O4
Mol. Mass.361.3956
SMILESNC(=O)C1CCCN1C(=O)C(Cc1cnc[nH]1)NC(=O)C1CCC(=O)C1