Reaction Details
TargetThyrotropin-releasing hormone receptor
LigandBDBM86215
Substrate/Competitorn/a
Ki>10000±n/a nM
CommentsPDSP_3210
Citation Lu, XBidaud, ILadram, AGershengorn, MC Pharmacological studies of thyrotropin-releasing hormone (TRH) receptors from Xenopus laevis: is xTRHR3 a TRH receptor? Endocrinology144:1842-6 (2003) 
 
Thyrotropin-releasing hormone receptor
Name:Thyrotropin-releasing hormone receptor
Type:Enzyme Catalytic Domain
Mol. Mass.:44568.52
Organism:MOUSE
Description:thyrotropin-releasing hormone R1 TRHR MOUSE::P21761
Residue:393
BDBM86215
NameBDBM86215
Synonyms:Pyr3TRH
TypeSmall organic molecule
Emp. Form.C17H23N5O4
Mol. Mass.361.3956
SMILESNC(=O)C1CCCN1C(=O)C(Cc1cnc[nH]1)NC(=O)[C@@H]1CCC(=O)C1