Reaction Details
TargetThyrotropin-releasing hormone receptor
LigandBDBM86214
Substrate/Competitorn/a
Ki 15±n/a nM
CommentsPDSP_3207
Citation Lu, XBidaud, ILadram, AGershengorn, MC Pharmacological studies of thyrotropin-releasing hormone (TRH) receptors from Xenopus laevis: is xTRHR3 a TRH receptor? Endocrinology144:1842-6 (2003) 
 
Thyrotropin-releasing hormone receptor
Name:Thyrotropin-releasing hormone receptor
Type:Enzyme Catalytic Domain
Mol. Mass.:44568.52
Organism:MOUSE
Description:thyrotropin-releasing hormone R1 TRHR MOUSE::P21761
Residue:393
BDBM86214
NameBDBM86214
Synonyms:CAS_32281 Phe2TRH | TRH
TypeSmall organic molecule
Emp. Form.C16H22N6O4
Mol. Mass.362.3837
SMILESNC(=O)C1CCCN1C(=O)C(Cc1cnc[nH]1)NC(=O)C1CCC(=O)N1