Reaction Details
TargetcAMP-specific 3',5'-cyclic phosphodiesterase 4B
LigandBDBM14773
Substrate/Competitorn/a
Ki 200±n/a nM
CommentsPDSP_3036
Citation Zhao, YZhang, HTO'Donnell, JM Inhibitor binding to type 4 phosphodiesterase (PDE4) assessed using [3H]piclamilast and [3H]rolipram. J Pharmacol Exp Ther305:565-72 (2003) 
 
cAMP-specific 3',5'-cyclic phosphodiesterase 4B
Name:cAMP-specific 3',5'-cyclic phosphodiesterase 4B
Type:Enzyme Catalytic Domain
Mol. Mass.:83349.50
Organism:RAT
Description:P14646
Residue:736
BDBM14773
NameBDBM14773
Synonyms:4-cyano-4-(3-cyclopentyloxy-4-methoxy-phenyl)cyclohexane-1-carboxylic acid Ariflo SB207499
TypeSmall organic molecule
Emp. Form.C20H25NO4
Mol. Mass.343.4168
SMILESCOc1ccc(cc1OC1CCCC1)C1(CCC(CC1)C(O)=O)C#N