Reaction Details
TargetcAMP-specific 3',5'-cyclic phosphodiesterase 4B
LigandBDBM50010981
Substrate/Competitorn/a
Ki>10000±n/a nM
CommentsPDSP_3034
Citation Zhao, YZhang, HTO'Donnell, JM Inhibitor binding to type 4 phosphodiesterase (PDE4) assessed using [3H]piclamilast and [3H]rolipram. J Pharmacol Exp Ther305:565-72 (2003) 
 
cAMP-specific 3',5'-cyclic phosphodiesterase 4B
Name:cAMP-specific 3',5'-cyclic phosphodiesterase 4B
Type:Enzyme Catalytic Domain
Mol. Mass.:83349.50
Organism:RAT
Description:P14646
Residue:736
BDBM50010981
NameBDBM50010981
Synonyms:(Ro 20-1724)4-(3-Butoxy-4-methoxy-benzyl)-imidazolidin-2-one 4-(3-Butoxy-4-methoxy-benzyl)-imidazolidin-2-one(Ro 20-1724) CHEMBL18701 Ro-20-1724
TypeSmall organic molecule
Emp. Form.C15H22N2O3
Mol. Mass.278.3468
SMILESCCCCOc1cc(CC2CNC(=O)N2)ccc1OC