Reaction Details
TargetD(1A) dopamine receptor
LigandBDBM86269
Substrate/Competitorn/a
Ki 0.6±n/a nM
CommentsPDSP_4924
Citation Neumeyer, JLKula, NSBergman, JBaldessarini, RJ Receptor affinities of dopamine D1 receptor-selective novel phenylbenzazepines. Eur J Pharmacol474:137-40 (2003) 
 
D(1A) dopamine receptor
Name:D(1A) dopamine receptor
Type:Enzyme Catalytic Domain
Mol. Mass.:49429.75
Organism:RAT
Description:P18901
Residue:446
BDBM86269
NameBDBM86269
Synonyms:MCL-209
TypeSmall organic molecule
Emp. Form.C17H18ClNO2
Mol. Mass.303.783
SMILESCc1cccc(c1)C1CNCCc2c(Cl)c(O)c(O)cc12