Reaction Details
TargetTyrosine-protein kinase JAK2
LigandBDBM277404
Substrate/Competitorn/a
Meas. Tech.Biochemical JAK Assay
pH7.5±n/a
Ki<0.1±n/a nM
Commentsextracted
Citation Huang, XThalladi, VR Crystalline form of 3-((1R,3s,5S)-3-((7-((5-methyl-1H-pyrazol-3-yl)amino)-1,6-naphthyridin-5-yl)amino)-8-azabicyclo[3.2.1]octan-8-yl)propanenitrile US Patent US10072026 Publication Date 9/11/2018
 
Tyrosine-protein kinase JAK2
Name:Tyrosine-protein kinase JAK2
Type:Protein
Mol. Mass.:130684.68
Organism:Homo sapiens (Human)
Description:O60674
Residue:1132
BDBM277404
NameBDBM277404
Synonyms:N7-(5-methyl-1H-pyrazol-3-yl)-2-(morpholinomethyl)-N5-((1R,3s,5S)-8-(2,2,2-trifluoroethyl)-8-azabicyclo[3.2.1]octan-3-yl)-1,6-naphthyridine-5,7-diamine US10947254, Example 15 | US11780852, Example 15
TypeSmall organic molecule
Emp. Form.C26H33F3N8O
Mol. Mass.530.5884
SMILESCc1cc(Nc2cc3nc(CN4CCOCC4)ccc3c(N[C@H]3C[C@@H]4CC[C@H](C3)N4CC(F)(F)F)n2)n[nH]1