Reaction Details
TargetNon-receptor tyrosine-protein kinase TYK2
LigandBDBM277547
Substrate/Competitorn/a
Meas. Tech.Biochemical JAK Assay
pH7.5±n/a
Ki 0.55±n/a nM
Commentsextracted
Citation Huang, XThalladi, VR Crystalline form of 3-((1R,3s,5S)-3-((7-((5-methyl-1H-pyrazol-3-yl)amino)-1,6-naphthyridin-5-yl)amino)-8-azabicyclo[3.2.1]octan-8-yl)propanenitrile US Patent US10072026 Publication Date 9/11/2018
 
Non-receptor tyrosine-protein kinase TYK2
Name:Non-receptor tyrosine-protein kinase TYK2
Type:Protein
Mol. Mass.:133666.03
Organism:Homo sapiens (Human)
Description:P29597
Residue:1187
BDBM277547
NameBDBM277547
Synonyms:US10072026, Example 5-9 | US11780852, Example 5-9
TypeSmall organic molecule
Emp. Form.C21H27N7O3S
Mol. Mass.457.549
SMILESCOc1ccc2c(N[C@H]3C[C@@H]4CC[C@H](C3)N4S(C)(=O)=O)nc(Nc3cc(C)[nH]n3)cc2n1