Reaction Details
TargetNon-receptor tyrosine-protein kinase TYK2
LigandBDBM277549
Substrate/Competitorn/a
Meas. Tech.Biochemical JAK Assay
pH7.5±n/a
Ki 0.55±n/a nM
Commentsextracted
Citation Huang, XThalladi, VR Crystalline form of 3-((1R,3s,5S)-3-((7-((5-methyl-1H-pyrazol-3-yl)amino)-1,6-naphthyridin-5-yl)amino)-8-azabicyclo[3.2.1]octan-8-yl)propanenitrile US Patent US10072026 Publication Date 9/11/2018
 
Non-receptor tyrosine-protein kinase TYK2
Name:Non-receptor tyrosine-protein kinase TYK2
Type:Protein
Mol. Mass.:133666.03
Organism:Homo sapiens (Human)
Description:P29597
Residue:1187
BDBM277549
NameBDBM277549
Synonyms:US10072026, Example 5-11
TypeSmall organic molecule
Emp. Form.C22H26N8O
Mol. Mass.418.4948
SMILESCc1cc(Nc2cc3nc(CO)ccc3c(N[C@H]3C[C@@H]4CC[C@H](C3)N4CC#N)n2)n[nH]1