Reaction Details
TargetMuscarinic acetylcholine receptor M3
LigandBDBM86292
Substrate/Competitorn/a
Ki 102.33±n/a nM
CommentsPDSP_3131
Citation De Amici, MConti, PFasoli, EBarocelli, EBallabeni, VBertoni, SImpicciatore, MRoth, BLErnsberger, PDe Micheli, C Synthesis and in vitro pharmacology of novel heterocyclic muscarinic ligands. Farmaco58:739-48 (2003) 
 
Muscarinic acetylcholine receptor M3
Name:Muscarinic acetylcholine receptor M3
Type:Enzyme
Mol. Mass.:66151.03
Organism:Homo sapiens (Human)
Description:P20309
Residue:590
BDBM86292
NameBDBM86292
Synonyms:2-[4-(2-Methyl-1H-imidazol-1-yl)-2-butynyl]isoxazolidin-3-one sesquifumarate NSC_0
TypeSmall organic molecule
Emp. Form.C11H13N3O2
Mol. Mass.219.2398
SMILESCc1nccn1CC#CCN1OCCC1=O