Reaction Details
TargetMuscarinic acetylcholine receptor M3
LigandBDBM86294
Substrate/Competitorn/a
Ki 6.31±n/a nM
CommentsPDSP_3134
Citation De Amici, MConti, PFasoli, EBarocelli, EBallabeni, VBertoni, SImpicciatore, MRoth, BLErnsberger, PDe Micheli, C Synthesis and in vitro pharmacology of novel heterocyclic muscarinic ligands. Farmaco58:739-48 (2003) 
 
Muscarinic acetylcholine receptor M3
Name:Muscarinic acetylcholine receptor M3
Type:Enzyme
Mol. Mass.:66151.03
Organism:Homo sapiens (Human)
Description:P20309
Residue:590
BDBM86294
NameBDBM86294
Synonyms:3-[4-(2,3-Dimethyl-1H-imidazolium-1-yl)-2-butynyl]oxy-delta2-isoxazoline iodide NSC_0
TypeSmall organic molecule
Emp. Form.C12H16N3O2
Mol. Mass.234.2738
SMILESCc1n(CC#CCOC2=NOCC2)cc[n+]1C