Reaction Details
TargetMuscarinic acetylcholine receptor M4
LigandBDBM82371
Substrate/Competitorn/a
Ki 3.47±n/a nM
CommentsPDSP_1918
Citation De Amici, MConti, PFasoli, EBarocelli, EBallabeni, VBertoni, SImpicciatore, MRoth, BLErnsberger, PDe Micheli, C Synthesis and in vitro pharmacology of novel heterocyclic muscarinic ligands. Farmaco58:739-48 (2003) 
 
Muscarinic acetylcholine receptor M4
Name:Muscarinic acetylcholine receptor M4
Type:Enzyme Catalytic Domain
Mol. Mass.:53079.31
Organism:Homo sapiens (Human)
Description:Cholinergic, muscarinic M4 CHRM4 HUMAN M3::P08173
Residue:479
BDBM82371
NameBDBM82371
Synonyms:CAS_1508-75-4 TROPICAMIDE
TypeSmall organic molecule
Emp. Form.C17H20N2O2
Mol. Mass.284.3529
SMILESCCN(Cc1ccncc1)C(=O)C(CO)c1ccccc1