Reaction Details
TargetMuscarinic acetylcholine receptor M2
LigandBDBM86312
Substrate/Competitorn/a
Ki 1200±n/a nM
CommentsPDSP_3401
Citation Jensen, AAMikkelsen, IFrølund, BBräuner-Osborne, HFalch, EKrogsgaard-Larsen, P Carbamoylcholine homologs: novel and potent agonists at neuronal nicotinic acetylcholine receptors. Mol Pharmacol64:865-75 (2003) 
 
Muscarinic acetylcholine receptor M2
Name:Muscarinic acetylcholine receptor M2
Type:Enzyme Catalytic Domain
Mol. Mass.:51555.53
Organism:RAT
Description:P10980
Residue:466
BDBM86312
NameBDBM86312
Synonyms:CAS_84607 NSC_84607
TypeSmall organic molecule
Emp. Form.C8H19N2O2
Mol. Mass.175.2481
SMILESCN(C)C(=O)OCC[N+](C)(C)C