Reaction Details
TargetNicotinic acetylcholine receptor
LigandBDBM86312
Substrate/Competitorn/a
Ki 20±n/a nM
CommentsPDSP_3401
Citation Jensen, AAMikkelsen, IFrølund, BBräuner-Osborne, HFalch, EKrogsgaard-Larsen, P Carbamoylcholine homologs: novel and potent agonists at neuronal nicotinic acetylcholine receptors. Mol Pharmacol64:865-75 (2003) 
 
Nicotinic acetylcholine receptor
Name:Nicotinic acetylcholine receptor
Type:Enzyme Catalytic Domain
Mol. Mass.:2478.99
Organism:RAT
Description:n-AChR 0 RAT::Q62594
Residue:23
BDBM86312
NameBDBM86312
Synonyms:CAS_84607 NSC_84607
TypeSmall organic molecule
Emp. Form.C8H19N2O2
Mol. Mass.175.2481
SMILESCN(C)C(=O)OCC[N+](C)(C)C