Reaction Details
Target5-hydroxytryptamine receptor 3A
LigandBDBM82479
Substrate/Competitorn/a
Ki 417±n/a nM
CommentsPDSP_1408
Citation Bymaster, FPFelder, CCTzavara, ENomikos, GGCalligaro, DOMckinzie, DL Muscarinic mechanisms of antipsychotic atypicality. Prog Neuropsychopharmacol Biol Psychiatry27:1125-43 (2003) 
 
5-hydroxytryptamine receptor 3A
Name:5-hydroxytryptamine receptor 3A
Type:Enzyme Catalytic Domain
Mol. Mass.:55657.07
Organism:GUINEA PIG
Description:5-HT3 HTR3A GUINEA PIG::O70212
Residue:490
BDBM82479
NameBDBM82479
Synonyms:CAS_132539-06-1 OLANZAPINE | USRE49340, Rank 2
TypeSmall organic molecule
Emp. Form.C17H20N4S
Mol. Mass.312.432
SMILESCN1CCN(CC1)C1=c2cc(C)sc2=Nc2ccccc2N1