Reaction Details
Target5-hydroxytryptamine receptor 6
LigandBDBM50130268
Substrate/Competitorn/a
Ki 2.57±n/a nM
CommentsPDSP_3218
Citation Hirst, WDAbrahamsen, BBlaney, FECalver, ARAloj, LPrice, GWMedhurst, AD Differences in the central nervous system distribution and pharmacology of the mouse 5-hydroxytryptamine-6 receptor compared with rat and human receptors investigated by radioligand binding, site-directed mutagenesis, and molecular modeling. Mol Pharmacol64:1295-308 (2003) 
 
5-hydroxytryptamine receptor 6
Name:5-hydroxytryptamine receptor 6
Type:G Protein-Coupled Receptor (GPCR)
Mol. Mass.:46968.43
Organism:Homo sapiens (Human)
Description:P50406
Residue:440
BDBM50130268
NameBDBM50130268
Synonyms:CHEMBL329383 N-(2,5-dibromo-3-fluorophenyl)-4-methoxy-3-(piperazin-1-yl)benzenesulfonamide | SB-357134
TypeSmall organic molecule
Emp. Form.C17H18Br2FN3O3S
Mol. Mass.523.215
SMILESCOc1ccc(cc1N1CCNCC1)S(=O)(=O)Nc1cc(Br)cc(F)c1Br