Reaction Details
TargetProtein kinase C alpha type
LigandBDBM86430
Substrate/Competitorn/a
Ki 12.6±n/a nM
CommentsPDSP_3228
Citation Wang, QJFang, TWYang, DLewin, NEVan Lint, JMarquez, VEBlumberg, PM Ligand structure-activity requirements and phospholipid dependence for the binding of phorbol esters to protein kinase D. Mol Pharmacol64:1342-8 (2003) 
 
Protein kinase C alpha type
Name:Protein kinase C alpha type
Type:Enzyme
Mol. Mass.:76755.65
Organism:Homo sapiens (Human)
Description:The recombinant human PKC enzymes were produced using a baculovirus expression system in SF9 cells
Residue:672
BDBM86430
NameBDBM86430
Synonyms:(-)-Indolactam V CAS_105000 | NSC_105000
TypeSmall organic molecule
Emp. Form.C17H23N3O2
Mol. Mass.301.3834
SMILESCC(C)C1N(C)c2cccc3[nH]cc(CC(CO)NC1=O)c23