Reaction Details
TargetProtein kinase C alpha type
LigandBDBM86436
Substrate/Competitorn/a
Ki 28.6±n/a nM
CommentsPDSP_3233
Citation Wang, QJFang, TWYang, DLewin, NEVan Lint, JMarquez, VEBlumberg, PM Ligand structure-activity requirements and phospholipid dependence for the binding of phorbol esters to protein kinase D. Mol Pharmacol64:1342-8 (2003) 
 
Protein kinase C alpha type
Name:Protein kinase C alpha type
Type:Enzyme
Mol. Mass.:76755.65
Organism:Homo sapiens (Human)
Description:The recombinant human PKC enzymes were produced using a baculovirus expression system in SF9 cells
Residue:672
BDBM86436
NameBDBM86436
Synonyms:3-hydroxy-2-[4-methyl-3-(methylethyl)pentanoyloxy]propyl 4-methyl-3-(methylethyl)pentanoate | 97D76
TypeSmall organic molecule
Emp. Form.C21H42O4
Mol. Mass.358.5558
SMILESCCC(C)(CCOC(CO)COC(=O)CC(C)(CC)C(C)C)C(C)C