Reaction Details
TargetProtein kinase C delta type
LigandBDBM86431
Substrate/Competitorn/a
Ki 0.55±n/a nM
CommentsPDSP_3226
Citation Wang, QJFang, TWYang, DLewin, NEVan Lint, JMarquez, VEBlumberg, PM Ligand structure-activity requirements and phospholipid dependence for the binding of phorbol esters to protein kinase D. Mol Pharmacol64:1342-8 (2003) 
 
Protein kinase C delta type
Name:Protein kinase C delta type
Type:Enzyme
Mol. Mass.:77516.79
Organism:Homo sapiens (Human)
Description:The recombinant human PKC enzymes were produced using a baculovirus expression system in SF9 cells
Residue:676
BDBM86431
NameBDBM86431
Synonyms:CAS_4179 NSC_4179
TypeSmall organic molecule
Emp. Form.C38H38O10
Mol. Mass.654.7023
SMILESCC1C(OC(=O)C=CC=Cc2ccccc2)C2(OC3(OC2C2C4OC4(CO)C(O)C4(O)C(C=C(C)C4=O)C12O3)c1ccccc1)C(C)=C