Reaction Details
Target5-hydroxytryptamine receptor 2B
LigandBDBM86441
Substrate/Competitorn/a
Ki 2.5±n/a nM
CommentsPDSP_3924
Citation Kimura, YHatanaka, KNaitou, YMaeno, KShimada, IKoakutsu, AWanibuchi, FYamaguchi, T Pharmacological profile of YM348, a novel, potent and orally active 5-HT2C receptor agonist. Eur J Pharmacol483:37-43 (2004) 
 
5-hydroxytryptamine receptor 2B
Name:5-hydroxytryptamine receptor 2B
Type:G Protein-Coupled Receptor (GPCR)
Mol. Mass.:54312.47
Organism:Homo sapiens (Human)
Description:Receptor binding assays were performed using human clone stably expressed in CHO cells.
Residue:481
BDBM86441
NameBDBM86441
Synonyms:CAS_3045225 YM348
TypeSmall organic molecule
Emp. Form.C14H17N3O
Mol. Mass.243.3043
SMILESCCc1cc2c(ccc3cnn(CC(C)N)c23)o1