Reaction Details
TargetBeta-2 adrenergic receptor
LigandBDBM25768
Substrate/Competitorn/a
Ki 0.7±n/a nM
CommentsPDSP_951
Citation Hoffmann, CLeitz, MROberdorf-Maass, SLohse, MJKlotz, KN Comparative pharmacology of human beta-adrenergic receptor subtypes--characterization of stably transfected receptors in CHO cells. Naunyn Schmiedebergs Arch Pharmacol369:151-9 (2004) 
 
Beta-2 adrenergic receptor
Name:Beta-2 adrenergic receptor
Type:n/a
Mol. Mass.:46461.69
Organism:Homo sapiens (Human)
Description:P07550
Residue:413
BDBM25768
NameBDBM25768
Synonyms:1-[(7-methyl-2,3-dihydro-1H-inden-4-yl)oxy]-3-(propan-2-ylamino)butan-2-ol ICI 118551
TypeSmall organic molecule
Emp. Form.C17H27NO2
Mol. Mass.277.4018
SMILESCC(C)NC(C)C(O)COc1ccc(C)c2CCCc12