Reaction Details
TargetSodium-dependent dopamine transporter
LigandBDBM50136680
Substrate/Competitorn/a
Ki 230±n/a nM
CommentsPDSP_763
Citation Vaishnavi, SNNemeroff, CBPlott, SJRao, SGKranzler, JOwens, MJ Milnacipran: a comparative analysis of human monoamine uptake and transporter binding affinity. Biol Psychiatry55:320-2 (2004) 
 
Sodium-dependent dopamine transporter
Name:Sodium-dependent dopamine transporter
Type:Multi-pass membrane protein
Mol. Mass.:68497.11
Organism:Homo sapiens (Human)
Description:Q01959
Residue:620
BDBM50136680
NameBDBM50136680
Synonyms:CHEMBL424660 N-methyl-3-(naphthalen-1-yloxy)-3-(2-thienyl)propan-1-amine | duloxetine
TypeSmall organic molecule
Emp. Form.C18H19NOS
Mol. Mass.297.415
SMILESCNCCC(Oc1cccc2ccccc12)c1cccs1