Reaction Details
TargetSodium-dependent noradrenaline transporter
LigandBDBM50136680
Substrate/Competitorn/a
Ki 20±n/a nM
CommentsPDSP_763
Citation Vaishnavi, SNNemeroff, CBPlott, SJRao, SGKranzler, JOwens, MJ Milnacipran: a comparative analysis of human monoamine uptake and transporter binding affinity. Biol Psychiatry55:320-2 (2004) 
 
Sodium-dependent noradrenaline transporter
Name:Sodium-dependent noradrenaline transporter
Type:Multi-pass membrane protein
Mol. Mass.:69337.72
Organism:Homo sapiens (Human)
Description:P23975
Residue:617
BDBM50136680
NameBDBM50136680
Synonyms:CHEMBL424660 N-methyl-3-(naphthalen-1-yloxy)-3-(2-thienyl)propan-1-amine | duloxetine
TypeSmall organic molecule
Emp. Form.C18H19NOS
Mol. Mass.297.415
SMILESCNCCC(Oc1cccc2ccccc12)c1cccs1