Reaction Details
TargetD(1A) dopamine receptor
LigandBDBM86466
Substrate/Competitorn/a
Ki 382±n/a nM
CommentsPDSP_4951
Citation Sit, SYXie, KJacutin-Porte, SBoy, KMSeanz, JTaber, MTGulwadi, AGKorpinen, CDBurris, KDMolski, TFRyan, EXu, CVerdoorn, TJohnson, GNichols, DEMailman, RB Synthesis and SAR exploration of dinapsoline analogues. Bioorg Med Chem12:715-34 (2004) 
 
D(1A) dopamine receptor
Name:D(1A) dopamine receptor
Type:Enzyme Catalytic Domain
Mol. Mass.:49429.75
Organism:RAT
Description:P18901
Residue:446
BDBM86466
NameBDBM86466
Synonyms:(+/-)-2-methyldinapsoline hydrobromide NSC_0
TypeSmall organic molecule
Emp. Form.C17H17NO2
Mol. Mass.267.3224
SMILESCN1C[C@H]2c3ccc(O)c(O)c3Cc3cccc(C1)c23